Sources update date ontology
type: Ontology
creator: http://www.en.nask.pl
description: An ontology describing when information about vulnerabilty was last time updated in a given source
description: Dates when given sources had been updated
rights: http://creativecommons.org/licenses/by-sa/4.0/
type: Class

date
type: DatatypeProperty
domain: Sources update date ontology
range: string
description: Date or date and time when given source had been updated

db
type: DatatypeProperty
domain: Sources update date ontology
range: string
description: Source database where entry had been updated

id
type: DatatypeProperty
domain: Sources update date ontology
range: string
description: Identifier of the updated entry in the external database