Sources release date ontology
type: Ontology
creator: http://www.en.nask.pl
description: An ontology describing when information about vulnerabilty was released in a given source
description: When information about vulnerability showed first time in the source database
rights: http://creativecommons.org/licenses/by-sa/4.0/
type: Class

date
type: DatatypeProperty
domain: Sources release date ontology
range: string
description: Timestamp when information has been published first time in the source database

db
type: DatatypeProperty
domain: Sources release date ontology
range: string
description: Source database

id
type: DatatypeProperty
domain: Sources release date ontology
range: string
description: Identifier in the source database