Ontologia pola sources
type: Ontology
creator: http://www.en.nask.pl
creator: http://www.nask.pl
description: An ontology describing sources providing a given piece of information
description: Ontologia pola sources opisującego źródła z których pochodzi dana informacja @pl
description: Sources of the information (entries from external databases)
rights: Sources entry ontology
rights: http://creativecommons.org/licenses/by-sa/4.0/
type: Class

db
type: DatatypeProperty
domain: Ontologia pola sources
range: string
description: Name of the source database

id
type: DatatypeProperty
domain: Ontologia pola sources
range: string
description: Identifier of the entry from the source database