References entry ontology
type: Ontology
type: Class
creator: http://www.en.nask.pl
description: An ontology describing references to the websites with details about a given vulnerability
description: Links to external sources for further reading about vulnerability
rights: http://creativecommons.org/licenses/by-sa/4.0/

trust
type: DatatypeProperty
comment: How trusted can be given URL
domain: References entry ontology
range: Datatype
  on datatype: decimal
  with restrictions:
    min exclusive: 0

url
type: DatatypeProperty
comment: An URL pointing to the external source with information related to the vulnerability
domain: References entry ontology
range: anyURI

sources
type: Class
description: Sources of the information (entries from external databases)

db
type: DatatypeProperty
description: Name of the source database
domain: sources
range: string

id
type: DatatypeProperty
description: Identifier of the entry from the source database
domain: sources
range: string