Patch entry ontology
type: Ontology
type: Class
creator: http://www.en.nask.pl
description: An ontology describing existing patches or workarounds for a given vulnerability
description: Information about available patch or workaround
rights: http://creativecommons.org/licenses/by-sa/4.0/

title
type: DatatypeProperty
description: Short description of the patch
domain: Patch entry ontology
range: string

trust
type: DatatypeProperty
description: How trusted can be information about patch
domain: Patch entry ontology
range: Datatype
  on datatype: decimal
  with restrictions:
    min exclusive: 0

url
type: DatatypeProperty
description: A link to the patch
domain: Patch entry ontology
range: anyURI

sources
type: Class
description: Sources of the information (entries from external databases)

db
type: DatatypeProperty
description: Name of the source database
domain: sources
range: string

id
type: DatatypeProperty
description: Identifier of the entry from the source database
domain: sources
range: string