IoT taxonomy entry ontology
type: Ontology
type: Class
creator: http://www.en.nask.pl
description: An ontology describing IoT device with IoT taxonomy
description: Describes category and subcategory of the vulnerable IoT device
rights: http://creativecommons.org/licenses/by-sa/4.0/

category
type: DatatypeProperty
description: Category of the vulnerable IoT device
domain: IoT taxonomy entry ontology
range: string

subcategory
type: DatatypeProperty
description: More detailed category of the vulnerable IoT device
domain: IoT taxonomy entry ontology
range: string

trust
type: DatatypeProperty
description: How trusted can be information about category and subcategory of the vulnerable IoT device
domain: IoT taxonomy entry ontology
range: Datatype
  on datatype: decimal
  with restrictions:
    min exclusive: 0

sources
type: Class
description: Sources of the information (entries from external databases)

db
type: DatatypeProperty
description: Name of the source database
domain: sources
range: string

id
type: DatatypeProperty
description: Identifier of the entry from the source database
domain: sources
range: string