IoT identicator ontology
type: Ontology
type: Class
creator: http://www.en.nask.pl
description: An ontology describing is vulnerability IoT related
description: Indicates whether vulnerability is IoT related or not
rights: http://creativecommons.org/licenses/by-sa/4.0/

data
type: DatatypeProperty
description: Indicates whether vulnerability is IoT related or not
domain: IoT identicator ontology
range: boolean

trust
type: DatatypeProperty
description: How trusted can be an information about vulnerability being IoT related or not
domain: IoT identicator ontology
range: Datatype
  on datatype: decimal
  with restrictions:
    min exclusive: 0

sources
type: Class
description: Sources of the information (entries from external databases)

db
type: DatatypeProperty
description: Name of the source database
domain: sources
range: string

id
type: DatatypeProperty
description: Identifier of the entry from the source database
domain: sources
range: string