Exploits availability entry ontology
type: Ontology
creator: http://www.en.nask.pl
description: An ontology describing available exploits for a given vulnerability
description: Links to the external resources with code exploiting the vulnerability
rights: http://creativecommons.org/licenses/by-sa/4.0/
type: Class

reference
type: DatatypeProperty
domain: Exploits availability entry ontology
range: anyURI
description: An URL to the external resource with a code of the exploit

trust
type: DatatypeProperty
domain: Exploits availability entry ontology
range: Datatype
  on datatype: decimal
  with restrictions:
    min exclusive: 0
description: How trusted can be information about the exploit

type
type: DatatypeProperty
domain: Exploits availability entry ontology
range: string
description: Type of the exploit e.g. Proof-of-Concept or working exploit

db
type: DatatypeProperty
domain: sources
range: string
description: Name of the source database

id
type: DatatypeProperty
domain: sources
range: string
description: Identifier of the entry from the source database

sources
type: Class
description: Sources of the information (entries from external databases)