Exploits availability entry ontology
type: Ontology
type: Class
creator: http://www.en.nask.pl
description: An ontology describing available exploits for a given vulnerability
description: Links to the external resources with code exploiting the vulnerability
rights: http://creativecommons.org/licenses/by-sa/4.0/

reference
type: DatatypeProperty
description: An URL to the external resource with a code of the exploit
domain: Exploits availability entry ontology
range: anyURI

trust
type: DatatypeProperty
description: How trusted can be information about the exploit
domain: Exploits availability entry ontology
range: Datatype
  on datatype: decimal
  with restrictions:
    min exclusive: 0

type
type: DatatypeProperty
description: Type of the exploit e.g. Proof-of-Concept or working exploit
domain: Exploits availability entry ontology
range: string

sources
type: Class
description: Sources of the information (entries from external databases)

db
type: DatatypeProperty
description: Name of the source database
domain: sources
range: string

id
type: DatatypeProperty
description: Identifier of the entry from the source database
domain: sources
range: string