Credits entry ontology
type: Ontology
creator: http://www.en.nask.pl
description: An ontology describing who or what organization disclosed information about vulnerability
description: Who disclosed information about vulnerability
rights: http://creativecommons.org/licenses/by-sa/4.0/
type: Class

data
type: DatatypeProperty
domain: Credits entry ontology
range: string
description: Person, group of persons or organization who disclosed information about vulnerability

trust
type: DatatypeProperty
domain: Credits entry ontology
range: Datatype
  on datatype: decimal
  with restrictions:
    min exclusive: 0
description: How information about credits can be trusted

db
type: DatatypeProperty
domain: sources
range: string
description: Name of the source database

id
type: DatatypeProperty
domain: sources
range: string
description: Identifier of the entry from the source database

sources
type: Class
description: Sources of the information (entries from external databases)