Configurations entry ontology
type: Ontology
creator: http://www.en.nask.pl
description: An ontology describing configurations of software and/or hardware affected by the vulnerability in the CPE format
description: Configurations of vulnerable software and hardware
rights: http://creativecommons.org/licenses/by-sa/4.0/
type: Class

CVE data version
type: DatatypeProperty
domain: Configurations entry ontology
range: string
description: Configuration version

cpe22Uri
type: DatatypeProperty
domain: Configurations entry ontology
range: anyURI
description: CPE identifier version 2.2

cpe23Uri
type: DatatypeProperty
domain: Configurations entry ontology
range: anyURI
description: CPE identifier version 2.3

operator
type: DatatypeProperty
domain: Configurations entry ontology
range: string
description: Logical operator to link vulnerable configurations. Can be AND or OR

vulnerable
type: DatatypeProperty
domain: Configurations entry ontology
range: boolean
description: Indicates whether given software or hardware is vulnerable or not

db
type: DatatypeProperty
domain: sources
range: string
description: Name of the source database

id
type: DatatypeProperty
domain: sources
range: string
description: Identifier of the entry from the source database

sources
type: Class
description: Sources of the information (entries from external databases)