Configurations entry ontology
type: Ontology
type: Class
creator: http://www.en.nask.pl
description: An ontology describing configurations of software and/or hardware affected by the vulnerability in the CPE format
description: Configurations of vulnerable software and hardware
rights: http://creativecommons.org/licenses/by-sa/4.0/

CVE data version
type: DatatypeProperty
description: Configuration version
domain: Configurations entry ontology
range: string

cpe22Uri
type: DatatypeProperty
description: CPE identifier version 2.2
domain: Configurations entry ontology
range: anyURI

cpe23Uri
type: DatatypeProperty
description: CPE identifier version 2.3
domain: Configurations entry ontology
range: anyURI

operator
type: DatatypeProperty
description: Logical operator to link vulnerable configurations. Can be AND or OR
domain: Configurations entry ontology
range: string

vulnerable
type: DatatypeProperty
description: Indicates whether given software or hardware is vulnerable or not
domain: Configurations entry ontology
range: boolean

sources
type: Class
description: Sources of the information (entries from external databases)

db
type: DatatypeProperty
description: Name of the source database
domain: sources
range: string

id
type: DatatypeProperty
description: Identifier of the entry from the source database
domain: sources
range: string