Affected products entry ontology
type: Ontology
type: Class
creator: http://www.en.nask.pl
description: An ontology describing products (hardware or software) affected by the vulnerability
description: Products (hardware or software) affected by the vulnerability
rights: http://creativecommons.org/licenses/by-sa/4.0/

model
type: DatatypeProperty
description: Model of the affected product
domain: Affected products entry ontology
range: string

scope
type: DatatypeProperty
description: Scope of the vulnerable affected products's versions. Can be: eq, lt, lte, gt or gte
domain: Affected products entry ontology
range: string

trust
type: DatatypeProperty
description: How affected product's details can be trusted
domain: Affected products entry ontology
range: string

vendor
type: DatatypeProperty
description: Affected produtc's vendor name
domain: Affected products entry ontology
range: string

sources
type: Class
description: Sources of the information (entries from external databases)

db
type: DatatypeProperty
description: Name of the source database
domain: sources
range: string

id
type: DatatypeProperty
description: Identifier of the entry from the source database
domain: sources
range: string